Reaction Details
TargetHistone-lysine N-methyltransferase, H3 lysine-79 specific
LigandBDBM297393
Substrate/Competitorn/a
Meas. Tech.Assays of Enzymatic Activity
Ki 845±472 nM
Kd 167±100 nM
KOFF 0.2 s-1
KON 1200000 M-1s-1
Citation Olhava, EJChesworth, RPollock, RMJin, L Inhibitors of protein methyltransferase DOT1L and methods of use thereof US Patent US10112968 Publication Date 10/30/2018
 
Histone-lysine N-methyltransferase, H3 lysine-79 specific
Name:Histone-lysine N-methyltransferase, H3 lysine-79 specific
Type:Protein
Mol. Mass.:184911.91
Organism:Homo sapiens (Human)
Description:Q8TEK3
Residue:1537
BDBM297393
NameBDBM297393
Synonyms:US10112968, Compound C94
TypeSmall organic molecule
Emp. Form.C24H34N8O4
Mol. Mass.498.578
SMILESCN(CCNC(=O)Nc1ccc(cc1)C(C)(C)C)C[C@H]1O[C@H]([C@H](O)[C@@H]1O)n1cnc2c(N)ncnc12