Reaction Details
TargetKappa-type opioid receptor
LigandBDBM156516
Substrate/Competitorn/a
Meas. Tech.enzyme assay
IC50 0.500±n/a nM
Citation Roberts, EGuerrero, MAUrbano, MRosen, H Kappa opioid ligands US Patent US10118915 Publication Date 11/6/2018
 
Kappa-type opioid receptor
Name:Kappa-type opioid receptor
Type:G Protein-Coupled Receptor (GPCR)
Mol. Mass.:42648.76
Organism:Homo sapiens (Human)
Description:P41145
Residue:380
BDBM156516
NameBDBM156516
Synonyms:US10118915, Compound 303 | US9682966, 303
TypeSmall organic molecule
Emp. Form.C27H35N5O2
Mol. Mass.461.5991
SMILESCOC1CN(CCC1NC1CCCCC1)c1nc2ccc(C)cc2cc1-c1nc(no1)C1CC1