Reaction Details
TargetProtein arginine N-methyltransferase 5
LigandBDBM297725
Substrate/Competitorn/a
Meas. Tech.PRMT5 Biochemical Assay
IC50<100±n/a nM
Citation Duncan, KWChesworth, RBoriack-Sjodin, PAMunchhof, MJ PRMT5 inhibitors and uses thereof US Patent US10118918 Publication Date 11/6/2018
 
Protein arginine N-methyltransferase 5
Name:Protein arginine N-methyltransferase 5
Type:Enzyme
Mol. Mass.:72679.99
Organism:Homo sapiens (Human)
Description:O14744
Residue:637
BDBM297725
NameBDBM297725
Synonyms:(S)No FitN-(2-hydroxy-3-(isoindolin-2-yl)propyl)-2-phenoxyacetamide US9732072, Compound 4
TypeSmall organic molecule
Emp. Form.C22H23N3O3
Mol. Mass.377.4363
SMILESO[C@@H](CNC(=O)COc1cccc2cccnc12)CN1Cc2ccccc2C1