Reaction Details
TargetProtein arginine N-methyltransferase 5
LigandBDBM297756
Substrate/Competitorn/a
Meas. Tech.PRMT5 Biochemical Assay
IC50<100±n/a nM
Citation Duncan, KWChesworth, RBoriack-Sjodin, PAMunchhof, MJ PRMT5 inhibitors and uses thereof US Patent US10118918 Publication Date 11/6/2018
 
Protein arginine N-methyltransferase 5
Name:Protein arginine N-methyltransferase 5
Type:Enzyme
Mol. Mass.:72679.99
Organism:Homo sapiens (Human)
Description:O14744
Residue:637
BDBM297756
NameBDBM297756
Synonyms:US10118918, Compound 38
TypeSmall organic molecule
Emp. Form.C23H30N6O4
Mol. Mass.454.5221
SMILESO[C@@H](CNC(=O)c1cc(NC2COC2)nc(n1)N1CCOCC1)CN1Cc2ccccc2C1