Reaction Details
TargetTissue-type plasminogen activator
LigandBDBM297796
Substrate/Competitorn/a
Meas. Tech.Plasma-based Clot Lysis Assay
IC50 14.0±n/a nM
Citation Ellermann, MValot, GCancho Grande, YHaßfeld, JKinzel, TKöbberling, JBeyer, KRöhrig, SSperzel, MStampfuß, JMeyer, IKöllnberger, MBurkhardt, NSchlemmer, KStegmann, CSchuhmacher, JWerner, MHeiermann, JHengeveld, WJ Piperidinylpyrazolopyrimidinones and their use US Patent US10118930 Publication Date 11/6/2018
 
Tissue-type plasminogen activator
Name:Tissue-type plasminogen activator
Type:Enzyme
Mol. Mass.:62931.08
Organism:Homo sapiens (Human)
Description:n/a
Residue:562
BDBM297796
NameBDBM297796
Synonyms:N-Isobutyl-5-oxo-7-(piperidin-4-yl)-4,5-dihydropyrazolo[1,5-a]pyrimidine-3-carboxamide hydrochloride | US10118930, Example 21
TypeSmall organic molecule
Emp. Form.C16H23N5O2
Mol. Mass.317.3861
SMILESCC(C)CNC(=O)c1cnn2c(cc(=O)[nH]c12)C1CCNCC1