Reaction Details
TargetTissue-type plasminogen activator
LigandBDBM297809
Substrate/Competitorn/a
Meas. Tech.Plasma-based Clot Lysis Assay
IC50 12.0±n/a nM
Citation Ellermann, MValot, GCancho Grande, YHaßfeld, JKinzel, TKöbberling, JBeyer, KRöhrig, SSperzel, MStampfuß, JMeyer, IKöllnberger, MBurkhardt, NSchlemmer, KStegmann, CSchuhmacher, JWerner, MHeiermann, JHengeveld, WJ Piperidinylpyrazolopyrimidinones and their use US Patent US10118930 Publication Date 11/6/2018
 
Tissue-type plasminogen activator
Name:Tissue-type plasminogen activator
Type:Enzyme
Mol. Mass.:62931.08
Organism:Homo sapiens (Human)
Description:n/a
Residue:562
BDBM297809
NameBDBM297809
Synonyms:7-(Piperidin-4-yl)-3-(3-propyl-1,2,4-oxadiazol-5-yl)pyrazolo[1,5-a]pyrimidin-5(4H)-one hydrochloride | US10118930, Example 34
TypeSmall organic molecule
Emp. Form.C16H20N6O2
Mol. Mass.328.369
SMILESCCCc1noc(n1)-c1cnn2c(cc(=O)[nH]c12)C1CCNCC1