Reaction Details
TargetTissue-type plasminogen activator
LigandBDBM297842
Substrate/Competitorn/a
Meas. Tech.Plasma-based Clot Lysis Assay
IC50 12.0±n/a nM
Citation Ellermann, MValot, GCancho Grande, YHaßfeld, JKinzel, TKöbberling, JBeyer, KRöhrig, SSperzel, MStampfuß, JMeyer, IKöllnberger, MBurkhardt, NSchlemmer, KStegmann, CSchuhmacher, JWerner, MHeiermann, JHengeveld, WJ Piperidinylpyrazolopyrimidinones and their use US Patent US10118930 Publication Date 11/6/2018
 
Tissue-type plasminogen activator
Name:Tissue-type plasminogen activator
Type:Enzyme
Mol. Mass.:62931.08
Organism:Homo sapiens (Human)
Description:n/a
Residue:562
BDBM297842
NameBDBM297842
Synonyms:(−)-trans-7-(2-Methylpiperidin-4-yl)-5-oxo-4,5-dihydropyrazolo[1,5-a]pyrimidine-3-carbonitrile trifluoroacetate | US10118930, Example 65
TypeSmall organic molecule
Emp. Form.C13H15N5O
Mol. Mass.257.2911
SMILESCC1CC(CCN1)c1cc(=O)[nH]c2c(cnn12)C#N