Reaction Details
TargetTissue-type plasminogen activator
LigandBDBM297950
Substrate/Competitorn/a
Meas. Tech.Plasma-based Clot Lysis Assay
IC50 8.70±n/a nM
Citation Ellermann, MValot, GCancho Grande, YHaßfeld, JKinzel, TKöbberling, JBeyer, KRöhrig, SSperzel, MStampfuß, JMeyer, IKöllnberger, MBurkhardt, NSchlemmer, KStegmann, CSchuhmacher, JWerner, MHeiermann, JHengeveld, WJ Piperidinylpyrazolopyrimidinones and their use US Patent US10118930 Publication Date 11/6/2018
 
Tissue-type plasminogen activator
Name:Tissue-type plasminogen activator
Type:Enzyme
Mol. Mass.:62931.08
Organism:Homo sapiens (Human)
Description:n/a
Residue:562
BDBM297950
NameBDBM297950
Synonyms:7-(piperidin-4-yl)-3-{5-[4-(trifluoromethyl)phenyl]-1,3,4-oxadiazol-2-yl}pyrazolo[1,5-a]pyrimidin-5(4H)-one hydrochloride | US10118930, Example 166
TypeSmall organic molecule
Emp. Form.C20H17F3N6O2
Mol. Mass.430.3832
SMILESFC(F)(F)c1ccc(cc1)-c1nnc(o1)-c1cnn2c(cc(=O)[nH]c12)C1CCNCC1