Reaction Details
TargetTissue-type plasminogen activator
LigandBDBM298096
Substrate/Competitorn/a
Meas. Tech.Plasma-based Clot Lysis Assay
IC50 11.0±n/a nM
Citation Ellermann, MValot, GCancho Grande, YHaßfeld, JKinzel, TKöbberling, JBeyer, KRöhrig, SSperzel, MStampfuß, JMeyer, IKöllnberger, MBurkhardt, NSchlemmer, KStegmann, CSchuhmacher, JWerner, MHeiermann, JHengeveld, WJ Piperidinylpyrazolopyrimidinones and their use US Patent US10118930 Publication Date 11/6/2018
 
Tissue-type plasminogen activator
Name:Tissue-type plasminogen activator
Type:Enzyme
Mol. Mass.:62931.08
Organism:Homo sapiens (Human)
Description:n/a
Residue:562
BDBM298096
NameBDBM298096
Synonyms:2-methyl-3-[3-(4-methylphenyl)-1,2,4-oxadiazol-5-yl]-7-(piperidin-4-yl)pyrazolo[1,5-a]pyrimidin-5(4H)-one hydrochloride | US10118930, Example 306
TypeSmall organic molecule
Emp. Form.C21H22N6O2
Mol. Mass.390.4384
SMILESCc1nn2c(cc(=O)[nH]c2c1-c1nc(no1)-c1ccc(C)cc1)C1CCNCC1