Reaction Details
TargetTissue-type plasminogen activator
LigandBDBM298114
Substrate/Competitorn/a
Meas. Tech.Plasma-based Clot Lysis Assay
IC50 12.0±n/a nM
Citation Ellermann, MValot, GCancho Grande, YHaßfeld, JKinzel, TKöbberling, JBeyer, KRöhrig, SSperzel, MStampfuß, JMeyer, IKöllnberger, MBurkhardt, NSchlemmer, KStegmann, CSchuhmacher, JWerner, MHeiermann, JHengeveld, WJ Piperidinylpyrazolopyrimidinones and their use US Patent US10118930 Publication Date 11/6/2018
 
Tissue-type plasminogen activator
Name:Tissue-type plasminogen activator
Type:Enzyme
Mol. Mass.:62931.08
Organism:Homo sapiens (Human)
Description:n/a
Residue:562
BDBM298114
NameBDBM298114
Synonyms:3-[(3,3-difluoroazetidin-1-yl)carbonyl]-7-(piperidin-4-yl)pyrazolo[1,5-a]pyrimidin-5 (4H)-one hydrochloride | US10118930, Example 326
TypeSmall organic molecule
Emp. Form.C15H17F2N5O2
Mol. Mass.337.3246
SMILESFC1(F)CN(C1)C(=O)c1cnn2c(cc(=O)[nH]c12)C1CCNCC1