Reaction Details
TargetTissue-type plasminogen activator
LigandBDBM298123
Substrate/Competitorn/a
Meas. Tech.Plasma-based Clot Lysis Assay
IC50 9.00±n/a nM
Citation Ellermann, MValot, GCancho Grande, YHaßfeld, JKinzel, TKöbberling, JBeyer, KRöhrig, SSperzel, MStampfuß, JMeyer, IKöllnberger, MBurkhardt, NSchlemmer, KStegmann, CSchuhmacher, JWerner, MHeiermann, JHengeveld, WJ Piperidinylpyrazolopyrimidinones and their use US Patent US10118930 Publication Date 11/6/2018
 
Tissue-type plasminogen activator
Name:Tissue-type plasminogen activator
Type:Enzyme
Mol. Mass.:62931.08
Organism:Homo sapiens (Human)
Description:n/a
Residue:562
BDBM298123
NameBDBM298123
Synonyms:3-(4-cyclohexyl-1,3-thiazol-2-yl)-7-(piperidin-4-yl)pyrazolo[1,5-a]pyrimidin-5(4H)-one hydrochloride | US10118930, Example 335
TypeSmall organic molecule
Emp. Form.C20H25N5OS
Mol. Mass.383.51
SMILESO=c1cc(C2CCNCC2)n2ncc(-c3nc(cs3)C3CCCCC3)c2[nH]1