Reaction Details
TargetTissue-type plasminogen activator
LigandBDBM298161
Substrate/Competitorn/a
Meas. Tech.Plasma-based Clot Lysis Assay
IC50 11.0±n/a nM
Citation Ellermann, MValot, GCancho Grande, YHaßfeld, JKinzel, TKöbberling, JBeyer, KRöhrig, SSperzel, MStampfuß, JMeyer, IKöllnberger, MBurkhardt, NSchlemmer, KStegmann, CSchuhmacher, JWerner, MHeiermann, JHengeveld, WJ Piperidinylpyrazolopyrimidinones and their use US Patent US10118930 Publication Date 11/6/2018
 
Tissue-type plasminogen activator
Name:Tissue-type plasminogen activator
Type:Enzyme
Mol. Mass.:62931.08
Organism:Homo sapiens (Human)
Description:n/a
Residue:562
BDBM298161
NameBDBM298161
Synonyms:Cyclobutyl 2-methyl-5-oxo-7-(piperidin-4-yl)-4,5-dihydropyrazolo[1,5-a]pyrimidine-3-carboxylate hydrochloride | US10118930, Example 364
TypeSmall organic molecule
Emp. Form.C17H22N4O3
Mol. Mass.330.3816
SMILESCc1nn2c(cc(=O)[nH]c2c1C(=O)OC1CCC1)C1CCNCC1