Reaction Details
TargetTissue-type plasminogen activator
LigandBDBM298180
Substrate/Competitorn/a
Meas. Tech.Plasma-based Clot Lysis Assay
IC50 15.0±n/a nM
Citation Ellermann, MValot, GCancho Grande, YHaßfeld, JKinzel, TKöbberling, JBeyer, KRöhrig, SSperzel, MStampfuß, JMeyer, IKöllnberger, MBurkhardt, NSchlemmer, KStegmann, CSchuhmacher, JWerner, MHeiermann, JHengeveld, WJ Piperidinylpyrazolopyrimidinones and their use US Patent US10118930 Publication Date 11/6/2018
 
Tissue-type plasminogen activator
Name:Tissue-type plasminogen activator
Type:Enzyme
Mol. Mass.:62931.08
Organism:Homo sapiens (Human)
Description:n/a
Residue:562
BDBM298180
NameBDBM298180
Synonyms:3-[5-(2-Methylprop-1-en-1-yl)-1,2,4-oxadiazol-3-yl]-7-(piperidin-4-yl)pyrazolo[1,5-a]pyrimidin-5 (4H)-one hydrochloride | US10118930, Example 383
TypeSmall organic molecule
Emp. Form.C17H20N6O2
Mol. Mass.340.3797
SMILESCC(C)=Cc1nc(no1)-c1cnn2c(cc(=O)[nH]c12)C1CCNCC1