Reaction Details
TargetTissue-type plasminogen activator
LigandBDBM298237
Substrate/Competitorn/a
Meas. Tech.Plasma-based Clot Lysis Assay
IC50 10.00±n/a nM
Citation Ellermann, MValot, GCancho Grande, YHaßfeld, JKinzel, TKöbberling, JBeyer, KRöhrig, SSperzel, MStampfuß, JMeyer, IKöllnberger, MBurkhardt, NSchlemmer, KStegmann, CSchuhmacher, JWerner, MHeiermann, JHengeveld, WJ Piperidinylpyrazolopyrimidinones and their use US Patent US10118930 Publication Date 11/6/2018
 
Tissue-type plasminogen activator
Name:Tissue-type plasminogen activator
Type:Enzyme
Mol. Mass.:62931.08
Organism:Homo sapiens (Human)
Description:n/a
Residue:562
BDBM298237
NameBDBM298237
Synonyms:3-[3-(2-methoxyphenyl)-1,2,4-oxadiazol-5-yl]-2-methyl-7-(piperidin-4-yl)pyrazolo[1,5-a]pyrimidin-5(4H)-one hydrochloride | US10118930, Example 437
TypeSmall organic molecule
Emp. Form.C21H22N6O3
Mol. Mass.406.4378
SMILESCOc1ccccc1-c1noc(n1)-c1c(C)nn2c(cc(=O)[nH]c12)C1CCNCC1