Reaction Details
TargetTissue-type plasminogen activator
LigandBDBM298238
Substrate/Competitorn/a
Meas. Tech.Plasma-based Clot Lysis Assay
IC50 12.0±n/a nM
Citation Ellermann, MValot, GCancho Grande, YHaßfeld, JKinzel, TKöbberling, JBeyer, KRöhrig, SSperzel, MStampfuß, JMeyer, IKöllnberger, MBurkhardt, NSchlemmer, KStegmann, CSchuhmacher, JWerner, MHeiermann, JHengeveld, WJ Piperidinylpyrazolopyrimidinones and their use US Patent US10118930 Publication Date 11/6/2018
 
Tissue-type plasminogen activator
Name:Tissue-type plasminogen activator
Type:Enzyme
Mol. Mass.:62931.08
Organism:Homo sapiens (Human)
Description:n/a
Residue:562
BDBM298238
NameBDBM298238
Synonyms:3-[3-(2-fluorophenyl)-1,2,4-oxadiazol-5-yl]-2-methyl-7-(piperidin-4-yl)pyrazolo[1,5-a]pyrimidin-5(4H)-one hydrochloride | US10118930, Example 438
TypeSmall organic molecule
Emp. Form.C20H19FN6O2
Mol. Mass.394.4023
SMILESCc1nn2c(cc(=O)[nH]c2c1-c1nc(no1)-c1ccccc1F)C1CCNCC1