Reaction Details
TargetTissue-type plasminogen activator
LigandBDBM298247
Substrate/Competitorn/a
Meas. Tech.Plasma-based Clot Lysis Assay
IC50 14.0±n/a nM
Citation Ellermann, MValot, GCancho Grande, YHaßfeld, JKinzel, TKöbberling, JBeyer, KRöhrig, SSperzel, MStampfuß, JMeyer, IKöllnberger, MBurkhardt, NSchlemmer, KStegmann, CSchuhmacher, JWerner, MHeiermann, JHengeveld, WJ Piperidinylpyrazolopyrimidinones and their use US Patent US10118930 Publication Date 11/6/2018
 
Tissue-type plasminogen activator
Name:Tissue-type plasminogen activator
Type:Enzyme
Mol. Mass.:62931.08
Organism:Homo sapiens (Human)
Description:n/a
Residue:562
BDBM298247
NameBDBM298247
Synonyms:3-[5-(3-fluoro-4-methoxybenzyl)-1,3,4-oxadiazol-2-yl]-7-(piperidin-4-yl)pyrazolo[1,5-a]pyrimidin-5(4H)-one hydrochloride | US10118930, Example 447
TypeSmall organic molecule
Emp. Form.C21H21FN6O3
Mol. Mass.424.4282
SMILESCOc1ccc(Cc2nnc(o2)-c2cnn3c(cc(=O)[nH]c23)C2CCNCC2)cc1F