Reaction Details
TargetTissue-type plasminogen activator
LigandBDBM298255
Substrate/Competitorn/a
Meas. Tech.Plasma-based Clot Lysis Assay
IC50 8.00±n/a nM
Citation Ellermann, MValot, GCancho Grande, YHaßfeld, JKinzel, TKöbberling, JBeyer, KRöhrig, SSperzel, MStampfuß, JMeyer, IKöllnberger, MBurkhardt, NSchlemmer, KStegmann, CSchuhmacher, JWerner, MHeiermann, JHengeveld, WJ Piperidinylpyrazolopyrimidinones and their use US Patent US10118930 Publication Date 11/6/2018
 
Tissue-type plasminogen activator
Name:Tissue-type plasminogen activator
Type:Enzyme
Mol. Mass.:62931.08
Organism:Homo sapiens (Human)
Description:n/a
Residue:562
BDBM298255
NameBDBM298255
Synonyms:3-(cyclopropylcarbonyl)-7-(piperidin-4-yl)pyrazolo[1,5-a]pyrimidin-5(4H)-one hydrochloride | US10118930, Example 453
TypeSmall organic molecule
Emp. Form.C15H18N4O2
Mol. Mass.286.329
SMILESO=C(C1CC1)c1cnn2c(cc(=O)[nH]c12)C1CCNCC1