Reaction Details
TargetNeprilysin
LigandBDBM298285
Substrate/Competitorn/a
Meas. Tech.Enzyme NEP Inhibition Assay
Ki<1.000±n/a nM
Citation Hughes, ADFenster, EFleury, MGendron, RMoran, EJ Neprilysin inhibitors US Patent US10123984 Publication Date 11/13/2018
 
Neprilysin
Name:Neprilysin
Type:Enzyme
Mol. Mass.:85505.38
Organism:Homo sapiens (Human)
Description:P08473
Residue:750
BDBM298285
NameBDBM298285
Synonyms:US10123984, Example 2A US11547687, Compound Example 2A US20230285340, Comparative Compound I
TypeSmall organic molecule
Emp. Form.C19H18ClNO6
Mol. Mass.391.802
SMILESO[C@H](C[C@@H](Cc1ccc(cc1)-c1cccc(Cl)c1)NC(=O)C(O)=O)C(O)=O