Reaction Details
TargetNeprilysin
LigandBDBM298291
Substrate/Competitorn/a
Meas. Tech.Enzyme NEP Inhibition Assay
Ki<1.000±n/a nM
Citation Hughes, ADFenster, EFleury, MGendron, RMoran, EJ Neprilysin inhibitors US Patent US10123984 Publication Date 11/13/2018
 
Neprilysin
Name:Neprilysin
Type:Enzyme
Mol. Mass.:85505.38
Organism:Homo sapiens (Human)
Description:P08473
Residue:750
BDBM298291
NameBDBM298291
Synonyms:US10123984, Example 2N US20230285340, Example 2N
TypeSmall organic molecule
Emp. Form.C24H24ClNO3
Mol. Mass.409.905
SMILESN[C@@H](C[C@@H](O)C(=O)OCc1ccccc1)Cc1ccc(cc1)-c1cccc(Cl)c1