Reaction Details
TargetNeprilysin
LigandBDBM298295
Substrate/Competitorn/a
Meas. Tech.Enzyme NEP Inhibition Assay
Ki<1.000±n/a nM
Citation Hughes, ADFenster, EFleury, MGendron, RMoran, EJ Neprilysin inhibitors US Patent US10123984 Publication Date 11/13/2018
 
Neprilysin
Name:Neprilysin
Type:Enzyme
Mol. Mass.:85505.38
Organism:Homo sapiens (Human)
Description:P08473
Residue:750
BDBM298295
NameBDBM298295
Synonyms:BDBM582703 US10123984, Example 3D US20230285340, Example 3A
TypeSmall organic molecule
Emp. Form.C19H17Cl2NO6
Mol. Mass.426.247
SMILESO[C@H](C[C@@H](Cc1ccc(cc1)-c1cc(Cl)ccc1Cl)NC(=O)C(O)=O)C(O)=O