Reaction Details
TargetNeprilysin
LigandBDBM298298
Substrate/Competitorn/a
Meas. Tech.Enzyme NEP Inhibition Assay
Ki<1.000±n/a nM
Citation Hughes, ADFenster, EFleury, MGendron, RMoran, EJ Neprilysin inhibitors US Patent US10123984 Publication Date 11/13/2018
 
Neprilysin
Name:Neprilysin
Type:Enzyme
Mol. Mass.:85505.38
Organism:Homo sapiens (Human)
Description:P08473
Residue:750
BDBM298298
NameBDBM298298
Synonyms:US10123984, Example 5-1
TypeSmall organic molecule
Emp. Form.C21H21Cl2NO6
Mol. Mass.454.301
SMILESCc1ccc(Cl)cc1-c1cc(C)c(CC(CC(O)C(O)=O)NC(=O)C(O)=O)cc1Cl