Reaction Details
TargetNeprilysin
LigandBDBM298299
Substrate/Competitorn/a
Meas. Tech.Enzyme NEP Inhibition Assay
Ki<1.000±n/a nM
Citation Hughes, ADFenster, EFleury, MGendron, RMoran, EJ Neprilysin inhibitors US Patent US10123984 Publication Date 11/13/2018
 
Neprilysin
Name:Neprilysin
Type:Enzyme
Mol. Mass.:85505.38
Organism:Homo sapiens (Human)
Description:P08473
Residue:750
BDBM298299
NameBDBM298299
Synonyms:US10123984, Example 5-5
TypeSmall organic molecule
Emp. Form.C19H15Cl2F2NO6
Mol. Mass.462.228
SMILESOC(CC(Cc1cc(Cl)c(cc1F)-c1cc(Cl)ccc1F)NC(=O)C(O)=O)C(O)=O