Reaction Details
TargetNeprilysin
LigandBDBM298306
Substrate/Competitorn/a
Meas. Tech.Enzyme NEP Inhibition Assay
Ki<1.000±n/a nM
Citation Hughes, ADFenster, EFleury, MGendron, RMoran, EJ Neprilysin inhibitors US Patent US10123984 Publication Date 11/13/2018
 
Neprilysin
Name:Neprilysin
Type:Enzyme
Mol. Mass.:85505.38
Organism:Homo sapiens (Human)
Description:P08473
Residue:750
BDBM298306
NameBDBM298306
Synonyms:US10123984, Example 7B | US11547687, Example 7B
TypeSmall organic molecule
Emp. Form.C24H28FNO6
Mol. Mass.445.4806
SMILESCCCCOC(=O)[C@H](CO)C[C@@H](Cc1ccc(cc1)-c1ccccc1F)NC(=O)C(O)=O