Reaction Details
TargetNeprilysin
LigandBDBM298307
Substrate/Competitorn/a
Meas. Tech.Enzyme NEP Inhibition Assay
Ki<1.000±n/a nM
Citation Hughes, ADFenster, EFleury, MGendron, RMoran, EJ Neprilysin inhibitors US Patent US10123984 Publication Date 11/13/2018
 
Neprilysin
Name:Neprilysin
Type:Enzyme
Mol. Mass.:85505.38
Organism:Homo sapiens (Human)
Description:P08473
Residue:750
BDBM298307
NameBDBM298307
Synonyms:US10123984, Example 8-2 US20230285340, Example 8-2
TypeSmall organic molecule
Emp. Form.C20H20FNO6
Mol. Mass.389.3743
SMILESOCC(CC(Cc1ccc(cc1)-c1ccccc1F)NC(=O)C(O)=O)C(O)=O