Reaction Details
TargetNeprilysin
LigandBDBM298322
Substrate/Competitorn/a
Meas. Tech.Enzyme NEP Inhibition Assay
Ki 3.55±n/a nM
Citation Hughes, ADFenster, EFleury, MGendron, RMoran, EJ Neprilysin inhibitors US Patent US10123984 Publication Date 11/13/2018
 
Neprilysin
Name:Neprilysin
Type:Enzyme
Mol. Mass.:85505.38
Organism:Homo sapiens (Human)
Description:P08473
Residue:750
BDBM298322
NameBDBM298322
Synonyms:US10123984, Example 14A US10123984, Example 14F US20230285340, Example 14C
TypeSmall organic molecule
Emp. Form.C20H25BrN2O9
Mol. Mass.517.324
SMILESCCOC(=O)[C@@H](CN(Cc1ccc(Br)cc1)NC(=O)C(=O)OCC)OC(=O)C(=O)OCC