Reaction Details
TargetIsoform C of Bromodomain-containing protein 4 (Short)
LigandBDBM298348
Substrate/Competitorn/a
Kd 1200±n/a nM
Citation Landau, SBKagey, M Bromodomain inhibitors US Patent US10124009 Publication Date 11/13/2018
 
Isoform C of Bromodomain-containing protein 4 (Short)
Name:Isoform C of Bromodomain-containing protein 4 (Short)
Type:n/a
Mol. Mass.:80477.46
Organism:Homo sapiens (Human)
Description:O60885-2
Residue:722
BDBM298348
NameBDBM298348
Synonyms:US10124009, Compound 3
TypeSmall organic molecule
Emp. Form.C21H21ClN4O3S
Mol. Mass.444.934
SMILESCc1sc-2c(c1C)C(=N[C@@H](CC(=O)OCCO)c1nnc(C)n-21)c1ccc(Cl)cc1