Reaction Details
TargetcAMP and cAMP-inhibited cGMP 3',5'-cyclic phosphodiesterase 10A
LigandBDBM50398017
Substrate/Competitorn/a
Meas. Tech.Inhibition Assay
IC50 0.32±n/a nM
Citation Ritzen, ALanggard, MKehler, JNielsen, JKilburn, JPFarah, MM Substituted imidazoles as PDE10A inhibitors US Patent US9592230 Publication Date 3/14/2017
 
cAMP and cAMP-inhibited cGMP 3',5'-cyclic phosphodiesterase 10A
Name:cAMP and cAMP-inhibited cGMP 3',5'-cyclic phosphodiesterase 10A
Type:Protein
Mol. Mass.:88412.52
Organism:Homo sapiens (Human)
Description:Q9Y233
Residue:779
BDBM50398017
NameBDBM50398017
Synonyms:CHEMBL2180411 US9592230, 5,8-Dimethyl-2-[2-(1-methyl-4-phenyl-1H-imidazol-2-yl)-ethyl]-[1,2,4]triazolo[1,5-a]pyridine
TypeSmall organic molecule
Emp. Form.C20H21N5
Mol. Mass.331.4142
SMILESCc1ccc(C)n2nc(CCc3nc(cn3C)-c3ccccc3)nc12