Reaction Details
TargetGlucocorticoid receptor
LigandBDBM50048342
Substrate/Competitorn/a
Meas. Tech.Receptor Binding Assay
Ki 0.720±n/a nM
Citation Weinstein, DSGong, HYang, MGXiao, Z Imide and acylurea derivatives as modulators of the glucocorticoid receptor US Patent US9593113 Publication Date 3/14/2017
 
Glucocorticoid receptor
Name:Glucocorticoid receptor
Type:Enzyme
Mol. Mass.:85656.87
Organism:Homo sapiens (Human)
Description:P04150
Residue:777
BDBM50048342
NameBDBM50048342
Synonyms:CHEMBL3315064 | US9593113, Example 30
TypeSmall organic molecule
Emp. Form.C28H27FN4O4
Mol. Mass.502.5368
SMILESCC(C)([C@@H]1c2ccc(nc2Oc2c(F)cccc12)-c1ccc(cc1)C(=O)N1CCCC1)C(=O)NC(N)=O