Reaction Details
TargetGlucocorticoid receptor
LigandBDBM299281
Substrate/Competitorn/a
Meas. Tech.Receptor Binding Assay
Ki 0.820±n/a nM
Citation Weinstein, DSGong, HYang, MGXiao, Z Imide and acylurea derivatives as modulators of the glucocorticoid receptor US Patent US9593113 Publication Date 3/14/2017
 
Glucocorticoid receptor
Name:Glucocorticoid receptor
Type:Enzyme
Mol. Mass.:85656.87
Organism:Homo sapiens (Human)
Description:P04150
Residue:777
BDBM299281
NameBDBM299281
Synonyms:US9593113, Example 45
TypeSmall organic molecule
Emp. Form.C24H20FN7O3
Mol. Mass.473.4591
SMILESCC(C)([C@@H]1c2ccc(nc2Oc2c(F)cccc12)-c1ccc(cc1)-n1cnnn1)C(=O)NC(N)=O