Reaction Details
TargetGlucocorticoid receptor
LigandBDBM299286
Substrate/Competitorn/a
Meas. Tech.Receptor Binding Assay
Ki 1.76±n/a nM
Citation Weinstein, DSGong, HYang, MGXiao, Z Imide and acylurea derivatives as modulators of the glucocorticoid receptor US Patent US9593113 Publication Date 3/14/2017
 
Glucocorticoid receptor
Name:Glucocorticoid receptor
Type:Enzyme
Mol. Mass.:85656.87
Organism:Homo sapiens (Human)
Description:P04150
Residue:777
BDBM299286
NameBDBM299286
Synonyms:US9593113, Example 50
TypeSmall organic molecule
Emp. Form.C28H26F2N4O4
Mol. Mass.520.5272
SMILESCC(C)([C@H]1c2ccccc2Oc2nc(ccc12)-c1ccc(cc1)C(=O)N1CCC(F)(F)C1)C(=O)NC(N)=O