Reaction Details
TargetGlucocorticoid receptor
LigandBDBM299300
Substrate/Competitorn/a
Meas. Tech.Receptor Binding Assay
Ki 1.70±n/a nM
Citation Weinstein, DSGong, HYang, MGXiao, Z Imide and acylurea derivatives as modulators of the glucocorticoid receptor US Patent US9593113 Publication Date 3/14/2017
 
Glucocorticoid receptor
Name:Glucocorticoid receptor
Type:Enzyme
Mol. Mass.:85656.87
Organism:Homo sapiens (Human)
Description:P04150
Residue:777
BDBM299300
NameBDBM299300
Synonyms:US9593113, Example 64
TypeSmall organic molecule
Emp. Form.C27H28FN5O3
Mol. Mass.489.5413
SMILESCC(C)([C@@H]1c2ccc(nc2Oc2c(F)cccc12)-c1ccc(nc1)N1CCCCC1)C(=O)NC(N)=O