Reaction Details
TargetGlucocorticoid receptor
LigandBDBM299305
Substrate/Competitorn/a
Meas. Tech.Receptor Binding Assay
Ki 0.320±n/a nM
Citation Weinstein, DSGong, HYang, MGXiao, Z Imide and acylurea derivatives as modulators of the glucocorticoid receptor US Patent US9593113 Publication Date 3/14/2017
 
Glucocorticoid receptor
Name:Glucocorticoid receptor
Type:Enzyme
Mol. Mass.:85656.87
Organism:Homo sapiens (Human)
Description:P04150
Residue:777
BDBM299305
NameBDBM299305
Synonyms:US9593113, Example 69
TypeSmall organic molecule
Emp. Form.C26H26FN3O4
Mol. Mass.463.5007
SMILESCC(C)(O)c1ccc(cc1)-c1ccc2[C@H](c3cccc(F)c3Oc2n1)C(C)(C)C(=O)NC(N)=O