Reaction Details
TargetE3 ubiquitin-protein ligase Mdm2 [1-188]
LigandBDBM215369
Substrate/Competitorn/a
Meas. Tech.Homogenous Time-Resolved Fluorescence Assay (HTRF2 Assay)
IC50 0.200±n/a nM
Citation Bartberger, MDGonzalez Buenrostro, ABeck, HPChen, XConnors, RVDeignan, JDuquette, JAEksterowicz, JFisher, BFox, BMFu, JFu, ZGonzalez Lopez De Turiso, FGribble, Jr., MWGustin, DJHeath, JAHuang, XJiao, XJohnson, MGKayser, FKopecky, DJLai, SLi, YLi, ZLiu, JLow, JDLucas, BSMa, ZMcGee, LRMcIntosh, JMcMinn, DLMedina, JCMihalic, JTOlson, SHRew, YRoveto, PMSun, DWang, XWang, YYan, XYu, MZhu, J Piperidinone derivatives as MDM2 inhibitors for the treatment of cancer US Patent US9593129 Publication Date 3/14/2017
 
E3 ubiquitin-protein ligase Mdm2 [1-188]
Name:E3 ubiquitin-protein ligase Mdm2 [1-188]
Type:n/a
Mol. Mass.:21319.18
Organism:Homo sapiens (Human)
Description:Q00987[1-188]
Residue:188
BDBM215369
NameBDBM215369
Synonyms:US9296736, 345 | US9593129, Example 345
TypeSmall organic molecule
Emp. Form.C28H35Cl2NO5S
Mol. Mass.568.552
SMILESCC[C@@H](CS(=O)(=O)C(C)C)N1[C@@H]([C@H](C[C@](CC)(CC(O)=O)C1=O)c1cccc(Cl)c1)c1ccc(Cl)cc1