Reaction Details
TargetMitogen-activated protein kinase kinase kinase kinase 4
LigandBDBM299436
Substrate/Competitorn/a
Meas. Tech.MAP4K4 Inhibition Assay
IC50 70.1±n/a nM
Citation Chen, HCrawford, THarris, SFMagnuson, SRNdubaku, CWang, L Aminoquinazoline and pyridopyrimidine derivatives US Patent US9592235 Publication Date 3/14/2017
 
Mitogen-activated protein kinase kinase kinase kinase 4
Name:Mitogen-activated protein kinase kinase kinase kinase 4
Type:Serine/threonine-protein kinase
Mol. Mass.:142114.73
Organism:Homo sapiens (Human)
Description:O95819
Residue:1239
BDBM299436
NameBDBM299436
Synonyms:N6-[2-(4-fluoro- phenyl)ethyl] pyrido[3,2-d] pyrimidine- 4,6-diamine US9855269, Compound 72
TypeSmall organic molecule
Emp. Form.C15H14FN5
Mol. Mass.283.3036
SMILESNc1ncnc2ccc(NCCc3ccc(F)cc3)nc12