Reaction Details
TargetMitogen-activated protein kinase kinase kinase kinase 4
LigandBDBM299462
Substrate/Competitorn/a
Meas. Tech.MAP4K4 Inhibition Assay
IC50 16.9±n/a nM
Citation Chen, HCrawford, THarris, SFMagnuson, SRNdubaku, CWang, L Aminoquinazoline and pyridopyrimidine derivatives US Patent US9592235 Publication Date 3/14/2017
 
Mitogen-activated protein kinase kinase kinase kinase 4
Name:Mitogen-activated protein kinase kinase kinase kinase 4
Type:Serine/threonine-protein kinase
Mol. Mass.:142114.73
Organism:Homo sapiens (Human)
Description:O95819
Residue:1239
BDBM299462
NameBDBM299462
Synonyms:6-(amino-5-fluoro- phenyl)pyrido [3,2-d]pyrimidin- 4-amine US9855269, Compound 90
TypeSmall organic molecule
Emp. Form.C13H10FN5
Mol. Mass.255.2504
SMILESNc1cc(F)cc(c1)-c1ccc2ncnc(N)c2n1