Reaction Details
TargetMitogen-activated protein kinase kinase kinase kinase 4
LigandBDBM299490
Substrate/Competitorn/a
Meas. Tech.MAP4K4 Inhibition Assay
IC50 107±n/a nM
Citation Chen, HCrawford, THarris, SFMagnuson, SRNdubaku, CWang, L Aminoquinazoline and pyridopyrimidine derivatives US Patent US9592235 Publication Date 3/14/2017
 
Mitogen-activated protein kinase kinase kinase kinase 4
Name:Mitogen-activated protein kinase kinase kinase kinase 4
Type:Serine/threonine-protein kinase
Mol. Mass.:142114.73
Organism:Homo sapiens (Human)
Description:O95819
Residue:1239
BDBM299490
NameBDBM299490
Synonyms:N-[3-(4-amino- pyrido[3,2-d] pyrimidin-6-yl)- 5-fluoro-phenyl]- 2-cyclopentyl- acetamide US9855269, Compound 110
TypeSmall organic molecule
Emp. Form.C20H20FN5O
Mol. Mass.365.4041
SMILESNc1ncnc2ccc(nc12)-c1cc(F)cc(NC(=O)CC2CCCC2)c1