Reaction Details
TargetMitogen-activated protein kinase kinase kinase kinase 4
LigandBDBM299497
Substrate/Competitorn/a
Meas. Tech.MAP4K4 Inhibition Assay
IC50 161±n/a nM
Citation Chen, HCrawford, THarris, SFMagnuson, SRNdubaku, CWang, L Aminoquinazoline and pyridopyrimidine derivatives US Patent US9592235 Publication Date 3/14/2017
 
Mitogen-activated protein kinase kinase kinase kinase 4
Name:Mitogen-activated protein kinase kinase kinase kinase 4
Type:Serine/threonine-protein kinase
Mol. Mass.:142114.73
Organism:Homo sapiens (Human)
Description:O95819
Residue:1239
BDBM299497
NameBDBM299497
Synonyms:N6-benzylpyrido [3,2-d] pyrimidine-4,6- diamine US9855269, Compound 117
TypeSmall organic molecule
Emp. Form.C14H13N5
Mol. Mass.251.2865
SMILESNc1ncnc2ccc(NCc3ccccc3)nc12