Reaction Details
TargetMitogen-activated protein kinase kinase kinase kinase 4
LigandBDBM225896
Substrate/Competitorn/a
Meas. Tech.MAP4K4 Inhibition Assay
IC50 6.20±n/a nM
Citation Chen, HCrawford, THarris, SFMagnuson, SRNdubaku, CWang, L Aminoquinazoline and pyridopyrimidine derivatives US Patent US9592235 Publication Date 3/14/2017
 
Mitogen-activated protein kinase kinase kinase kinase 4
Name:Mitogen-activated protein kinase kinase kinase kinase 4
Type:Serine/threonine-protein kinase
Mol. Mass.:142114.73
Organism:Homo sapiens (Human)
Description:O95819
Residue:1239
BDBM225896
NameBDBM225896
Synonyms:MAP15 US9855269, Compound 119
TypeSmall Organic Molecule
Emp. Form.C16H19N7
Mol. Mass.309.369
SMILESCc1c[nH]nc1C1CCCN(C1)c1ccc2ncnc(N)c2n1