Reaction Details
TargetMitogen-activated protein kinase kinase kinase kinase 4
LigandBDBM299537
Substrate/Competitorn/a
Meas. Tech.MAP4K4 Inhibition Assay
IC50 50.5±n/a nM
Citation Chen, HCrawford, THarris, SFMagnuson, SRNdubaku, CWang, L Aminoquinazoline and pyridopyrimidine derivatives US Patent US9592235 Publication Date 3/14/2017
 
Mitogen-activated protein kinase kinase kinase kinase 4
Name:Mitogen-activated protein kinase kinase kinase kinase 4
Type:Serine/threonine-protein kinase
Mol. Mass.:142114.73
Organism:Homo sapiens (Human)
Description:O95819
Residue:1239
BDBM299537
NameBDBM299537
Synonyms:6-(2-methyl-4- pyridyl)pyrido [3,2-d]pyrimidin- 4-amine US9855269, Compound 156
TypeSmall organic molecule
Emp. Form.C13H11N5
Mol. Mass.237.2599
SMILESCc1cc(ccn1)-c1ccc2ncnc(N)c2n1