Reaction Details
TargetNeprilysin
LigandBDBM299628
Substrate/Competitorn/a
Meas. Tech.Enzyme Inhibition Assay
Ki<1.00±n/a nM
Citation Fleury, MBeausoliel, AHughes, ADLong, DDWilton, DA Neprilysin inhibitors US Patent US9593110 Publication Date 3/14/2017
 
Neprilysin
Name:Neprilysin
Type:Enzyme
Mol. Mass.:85505.38
Organism:Homo sapiens (Human)
Description:P08473
Residue:750
BDBM299628
NameBDBM299628
Synonyms:(2S,4S)-5-(3′-Bromobiphenyl-4-yl)-2-methoxymethyl-4-[(3H-[1,2,3]triazole-4-carbonyl)amino]pentanoic Acid | US9593110, Example 80
TypeSmall organic molecule
Emp. Form.C22H23BrN4O4
Mol. Mass.487.346
SMILESCOC[C@H](C[C@@H](Cc1ccc(cc1)-c1cccc(Br)c1)NC(=O)c1cnn[nH]1)C(O)=O