Reaction Details
TargetNeprilysin
LigandBDBM299635
Substrate/Competitorn/a
Meas. Tech.Enzyme Inhibition Assay
Ki<1.00±n/a nM
Citation Fleury, MBeausoliel, AHughes, ADLong, DDWilton, DA Neprilysin inhibitors US Patent US9593110 Publication Date 3/14/2017
 
Neprilysin
Name:Neprilysin
Type:Enzyme
Mol. Mass.:85505.38
Organism:Homo sapiens (Human)
Description:P08473
Residue:750
BDBM299635
NameBDBM299635
Synonyms:(2R,4R)-5-(5′-Chloro-2′-fluorobiphenyl-4-yl)-4-[(3-ethylisoxazole-5-carbonyl)amino]-2-methoxycarbonylaminopentanoic Acid | US9593110, Example 29
TypeSmall organic molecule
Emp. Form.C26H27ClFN3O6
Mol. Mass.531.96
SMILESCCc1cc(on1)C(=O)N[C@@H](C[C@@H](CNC(=O)OC)C(O)=O)Cc1ccc(cc1)-c1cc(Cl)ccc1F