Reaction Details
TargetNeprilysin
LigandBDBM300272
Substrate/Competitorn/a
Meas. Tech.Enzyme Inhibition Assay
Ki<1.00±n/a nM
Citation Fleury, MBeausoliel, AHughes, ADLong, DDWilton, DA Neprilysin inhibitors US Patent US9593110 Publication Date 3/14/2017
 
Neprilysin
Name:Neprilysin
Type:Enzyme
Mol. Mass.:85505.38
Organism:Homo sapiens (Human)
Description:P08473
Residue:750
BDBM300272
NameBDBM300272
Synonyms:US9593110, 62
TypeSmall Organic Molecule
Emp. Form.C24H22ClFN6O3
Mol. Mass.496.921
SMILESOC(=O)[C@@H](C[C@@H](Cc1ccc(cc1)-c1cc(Cl)ccc1F)NC(=O)c1cnn[nH]1)Cn1ccnc1