Reaction Details
TargetNeprilysin
LigandBDBM300294
Substrate/Competitorn/a
Meas. Tech.Enzyme Inhibition Assay
Ki<1.00±n/a nM
Citation Fleury, MBeausoliel, AHughes, ADLong, DDWilton, DA Neprilysin inhibitors US Patent US9593110 Publication Date 3/14/2017
 
Neprilysin
Name:Neprilysin
Type:Enzyme
Mol. Mass.:85505.38
Organism:Homo sapiens (Human)
Description:P08473
Residue:750
BDBM300294
NameBDBM300294
Synonyms:US9593110, 7-2
TypeSmall Organic Molecule
Emp. Form.C27H28ClF2N3O4
Mol. Mass.531.979
SMILESCCOC[C@H](C[C@@H](Cc1ccc(cc1)-c1cc(Cl)ccc1F)NC(=O)c1[nH]nc(C2CC2)c1F)C(O)=O