Reaction Details
TargetNeprilysin
LigandBDBM300347
Substrate/Competitorn/a
Meas. Tech.Enzyme Inhibition Assay
Ki<1.00±n/a nM
Citation Fleury, MBeausoliel, AHughes, ADLong, DDWilton, DA Neprilysin inhibitors US Patent US9593110 Publication Date 3/14/2017
 
Neprilysin
Name:Neprilysin
Type:Enzyme
Mol. Mass.:85505.38
Organism:Homo sapiens (Human)
Description:P08473
Residue:750
BDBM300347
NameBDBM300347
Synonyms:US9593110, 16-23
TypeSmall Organic Molecule
Emp. Form.C28H25ClF2N4O3
Mol. Mass.538.973
SMILESCc1ccccc1-c1n[nH]c(C(=O)N[C@@H](C[C@@H](N)C(O)=O)Cc2ccc(cc2)-c2cc(Cl)ccc2F)c1F