Reaction Details
TargetTyrosine-protein kinase receptor UFO
LigandBDBM300064
Substrate/Competitorn/a
Meas. Tech.Enzyme Assay
Ki 0.028±n/a nM
Citation Johnson, TWRichardson, PFCollins, MRRichter, DTBurke, BJNinkovic, SGajiwala, KSLinton, MALe, PTHoffman, JE Axl inhibitors US Patent US9593097 Publication Date 3/14/2017
 
Tyrosine-protein kinase receptor UFO
Name:Tyrosine-protein kinase receptor UFO
Type:Enzyme
Mol. Mass.:98316.97
Organism:Homo sapiens (Human)
Description:P30530
Residue:894
BDBM300064
NameBDBM300064
Synonyms:N-[(2R)-1- hydroxypropan-2- yl]-4-{[(2R)-1- methoxypropan-2- yl]oxy}-6-[4-(4- methoxy-1H- pyrrolo[2,3- b]pyridin-3- yl)piperidin-1-yl]- 1,3,5-triazine-2- carboxamide | US9593097, Example 444
TypeSmall organic molecule
Emp. Form.C24H33N7O5
Mol. Mass.499.5627
SMILESCOC[C@@H](C)Oc1nc(nc(n1)C(=O)N[C@H](C)CO)N1CCC(CC1)c1c[nH]c2nccc(OC)c12