Reaction Details
TargetTyrosine-protein kinase receptor UFO
LigandBDBM300070
Substrate/Competitorn/a
Meas. Tech.Enzyme Assay
Ki 0.020±n/a nM
Citation Johnson, TWRichardson, PFCollins, MRRichter, DTBurke, BJNinkovic, SGajiwala, KSLinton, MALe, PTHoffman, JE Axl inhibitors US Patent US9593097 Publication Date 3/14/2017
 
Tyrosine-protein kinase receptor UFO
Name:Tyrosine-protein kinase receptor UFO
Type:Enzyme
Mol. Mass.:98316.97
Organism:Homo sapiens (Human)
Description:P30530
Residue:894
BDBM300070
NameBDBM300070
Synonyms:N-[(2R)-3- hydroxy-3- methylbutan-2-yl]- 4-[4-(4-methoxy- 1H-pyrrolo[2,3- b]pyridin-3- yl)piperidin-1-yl]-6- [(2R)- tetrahydrofuran-2- ylmethoxy]-1,3,5- triazine-2- carboxamide | US9593097, Example 450
TypeSmall organic molecule
Emp. Form.C27H37N7O5
Mol. Mass.539.6266
SMILESCOc1ccnc2[nH]cc(C3CCN(CC3)c3nc(OC[C@H]4CCCO4)nc(n3)C(=O)N[C@H](C)C(C)(C)O)c12