Reaction Details
TargetTyrosine-protein kinase receptor UFO
LigandBDBM300090
Substrate/Competitorn/a
Meas. Tech.Enzyme Assay
Ki 0.020±n/a nM
Citation Johnson, TWRichardson, PFCollins, MRRichter, DTBurke, BJNinkovic, SGajiwala, KSLinton, MALe, PTHoffman, JE Axl inhibitors US Patent US9593097 Publication Date 3/14/2017
 
Tyrosine-protein kinase receptor UFO
Name:Tyrosine-protein kinase receptor UFO
Type:Enzyme
Mol. Mass.:98316.97
Organism:Homo sapiens (Human)
Description:P30530
Residue:894
BDBM300090
NameBDBM300090
Synonyms:N-[(2R)-1- hydroxypropan-2- yl]-2-[(2S)-2- methoxypropoxy]- 6-[4-(4-methoxy- 1H-pyrrolo[2,3- b]pyridin-3- yl)piperidin-1- yl]pyrimidine-4- carboxamide | US9593097, Example 471
TypeSmall organic molecule
Emp. Form.C25H34N6O5
Mol. Mass.498.5747
SMILESCO[C@@H](C)COc1nc(cc(n1)C(=O)N[C@H](C)CO)N1CCC(CC1)c1c[nH]c2nccc(OC)c12