Reaction Details
TargetTyrosine-protein kinase receptor UFO
LigandBDBM300091
Substrate/Competitorn/a
Meas. Tech.Enzyme Assay
Ki 0.048±n/a nM
Citation Johnson, TWRichardson, PFCollins, MRRichter, DTBurke, BJNinkovic, SGajiwala, KSLinton, MALe, PTHoffman, JE Axl inhibitors US Patent US9593097 Publication Date 3/14/2017
 
Tyrosine-protein kinase receptor UFO
Name:Tyrosine-protein kinase receptor UFO
Type:Enzyme
Mol. Mass.:98316.97
Organism:Homo sapiens (Human)
Description:P30530
Residue:894
BDBM300091
NameBDBM300091
Synonyms:N-[(3R,4S)-4- hydroxytetrahydro- furan-3-yl]-2- {[(2R)-1- methoxypropan-2- yl]oxy}-6-[4-(4- methoxy-1H- pyrrolo[2,3- b]pyridin-3- yl)piperidin-1- yl]pyrimidine-4- carboxamide | US9593097, Example 472
TypeSmall organic molecule
Emp. Form.C26H34N6O6
Mol. Mass.526.5848
SMILESCOC[C@@H](C)Oc1nc(cc(n1)C(=O)N[C@@H]1COC[C@H]1O)N1CCC(CC1)c1c[nH]c2nccc(OC)c12