Reaction Details
TargetNADPH oxidase 1
LigandBDBM289784
Substrate/Competitorn/a
Meas. Tech.ROS Production Measurement on hNOX1 Membranes
Ki 22.0±n/a nM
Citation Machin, PSharpe, ALock, CJChambers, MSHodges, AAllen, VEllard, JM Amido thiadiazole derivatives as NADPH oxidase inhibitors US Patent US10130619 Publication Date 11/20/2018
 
NADPH oxidase 1
Name:NADPH oxidase 1
Type:PROTEIN
Mol. Mass.:64890.44
Organism:Homo sapiens (Human)
Description:ChEMBL_792877
Residue:564
BDBM289784
NameBDBM289784
Synonyms:US10130619, Example 7
TypeSmall organic molecule
Emp. Form.C23H20N4O4S
Mol. Mass.448.494
SMILESCOc1cc(ccc1O[C@@H](CO)c1ccccc1)C(=O)Nc1nnc(s1)-c1ccncc1