Reaction Details
TargetNADPH oxidase 1
LigandBDBM300371
Substrate/Competitorn/a
Meas. Tech.ROS Production Measurement on hNOX1 Membranes
Ki 21.0±n/a nM
Citation Machin, PSharpe, ALock, CJChambers, MSHodges, AAllen, VEllard, JM Amido thiadiazole derivatives as NADPH oxidase inhibitors US Patent US10130619 Publication Date 11/20/2018
 
NADPH oxidase 1
Name:NADPH oxidase 1
Type:PROTEIN
Mol. Mass.:64890.44
Organism:Homo sapiens (Human)
Description:ChEMBL_792877
Residue:564
BDBM300371
NameBDBM300371
Synonyms:US10130619, Example 51
TypeSmall organic molecule
Emp. Form.C25H27N7O2S
Mol. Mass.489.593
SMILESC[C@H](Oc1ncc(cc1NCCN(C)C)C(=O)Nc1nnc(s1)-c1ccncc1)c1ccccc1